{"text_format":"1","workbook":"xlsx","n_sheets":7,"sheets":["Front_Sheet","Background Info","Readiness_Sort","Self Assessment","Task Rating_Sort","Graphs","Lookups"],"not_rendered":{"charts":3,"images":6,"macros":1,"external_links":0,"defined_names":7,"comments":0,"pivot_tables":0},"unopened":[],"bounds":{"document_bytes":16777216,"sheet_cells":100000,"rows_first":2000,"rows_last":500,"rows_between":2000,"halvings":0,"cell_chars":16384,"cell_head_chars":4096},"cells_cut":0,"cells_raw":0,"read":"whole","date_system":"1900"}

{"sheet":"Front_Sheet","index":0,"n_rows":15,"n_cols":3,"rows_kept":15,"cut":false,"hidden":false,"merged":[]}
[]
[null,null,"Future in mind: Promoting, protecting and improving our children and young people's mental health and wellbeing"]
[null,"Self Assessment Tool:","This self assessment tool was developed by Associate Development Solutions to enable organisations to assess readiness to meet the recommendations laid out in the 'Future in mind' document published by Department of Health and NHS England in 2015. "]
[null,"Name of Organisation:","Northampton Self Assessment"]
[]
[null,null,"Contents (by tab):"]
[null,"Background Info:","Lists all summary actions from the 'Future in mind' document and aligns them with their associated sections from within the document"]
[null,"Self-Assessment:","This is the section that organisations populate with your perceived readiness to address the recommendations of the 'Future in mind' report*\n\n*Although not all recommendations made within the report are aimed directly at the organisations using this assessment tool, they will all impact the organisation in some manner were they to be agreed or actioned. Where this is the case, it is the intention of this document for organisations to determine their ability or readiness to respond once these recommendations were to be acted upon."]
{"$rows_left_out":8}
{"sheet":"Background Info","index":1,"n_rows":56,"n_cols":3,"rows_kept":56,"cut":false,"hidden":false,"merged":[[51,1,51,2],[1,1,1,2],[7,1,7,2],[22,1,22,2],[33,1,33,2],[44,1,44,2]]}
["Current or Future","ACTION","Associated Paragraph in 'Future in Mind'"]
[null,"Resilience, prevention and early intervention for the mental wellbeing of children and young people\nOur aim is to act early to prevent harm, by investing in the early years, supporting families and those who care for children and building resilience through to adulthood. Strategies should be developed in partnership with children and young people to support self-care. This will reduce the burden of mental and physical ill health over the whole life course."]
["Current","1. Promoting and driving established requirements and programmes of work on prevention and early intervention, including harnessing learning from the new 0-2 year old early intervention pilots.","Current action to improve early support for parents, carers and children from birth (1 and 4)\n• The Mandate between the Government and NHS England sets an objective to work with partner organisations to ensure that the NHS reduces the incidence and impact of postnatal depression through earlier diagnosis, and better intervention and support.\n• The Mandate between Health Education England (HEE) and the Government recognises the importance of maternal mental health during pregnancy and after birth – by 2017, every birthing unit should have access to a specialist perinatal mental health clinician.\n• The Institute for Health Visitors is updating training given to all health visitors around mental health and the Department of Health is working with HEE, the Royal College\nof Midwives and the Maternal Mental Health Alliance to design training programmes for midwives.\n• Public Health England is publishing an update of the evidence base for the Healthy Child Programme37 (0-5 years) that will guide professionals including supporting early attachment between infant and parent(s).\n• Ensuring progress with these mandate requirements and workforce capability will support better mental wellbeing for children and young people into the future. In addition, Achieving Better Access to Mental Health Services by 2020 sets out that DH and NHS England will consider developing an access and/or waiting standard for rapid access to mental health services for women in pregnancy or in the postnatal period with a known or suspected mental health problem.\n• In the 2014 Autumn Statement to Parliament, the Chancellor announced a 0-2 year old early intervention pilot to prevent avoidable problems later in life. The Pilots will be run jointly by DfE and DH. They will complement the work of the Early Intervention Foundation, and link closely with other activity such as the Healthy Child Programme and the Troubled Families Programme. Details of how and where the pilots will operate will be made available shortly. Government will consider the emerging evidence in relation to prevention and intervening early with mental health problems."]
["Current","2. Continuing to develop whole school approaches to promoting mental health and wellbeing, including building on the Department for Education’s current work on character and resilience, PSHE and counselling services in schools.","4.15 We encourage all schools (including those in the independent sector) to continue to develop whole school approaches to promoting mental health and wellbeing (2). This will build on the Department for Education’s current work on character building, PSHE and counselling\nservices in schools (see box for details). The named mental health lead for schools proposed in chapter five would also make an important contribution to leading and developing whole school approaches."]
["Current","3. Building on the success of the existing anti-stigma campaign led by Time to Change, and approaches piloted in 2014/15, to promote a broader national conversation about, and raise awareness of mental health issues for children and young people.","4.19 To this end, the Taskforce proposed there could be a major national branded social marketing campaign with a mechanism for dialogue so it is a genuine two-way conversation – driven by children, young people, parents and carers (3). Options include building on the Time to Change campaign (www.time-to-change.org. uk/youngpeople) as well as looking for opportunities to address mental health and wellbeing issues with the Public Health England Rise Above44 campaign."]
["Future","4. Enhancing existing maternal, perinatal and early years health services and parenting programmes to strengthen attachment between parent and child, avoid early trauma, build resilience and improve behaviour by ensuring parents have access to evidencebased programmes of intervention and support.","Current action to improve early support for parents, carers and children from birth (1 and 4)\n• The Mandate between the Government and NHS England sets an objective to work with partner organisations to ensure that the NHS reduces the incidence and impact of postnatal depression through earlier diagnosis, and better intervention and support.\n• The Mandate between Health Education England (HEE) and the Government recognises the importance of maternal mental health during pregnancy and after birth – by 2017, every birthing unit should have access to a specialist perinatal mental health clinician.\n• The Institute for Health Visitors is updating training given to all health visitors around mental health and the Department of Health is working with HEE, the Royal College\nof Midwives and the Maternal Mental Health Alliance to design training programmes for midwives.\n• Public Health England is publishing an update of the evidence base for the Healthy Child Programme37 (0-5 years) that will guide professionals including supporting early attachment between infant and parent(s).\n• Ensuring progress with these mandate requirements and workforce capability will support better mental wellbeing for children and young people into the future. In addition, Achieving Better Access to Mental Health Services by 2020 sets out that DH and NHS England will consider developing an access and/or waiting standard for rapid access to mental health services for women in pregnancy or in the postnatal period with a known or suspected mental health problem.\n• In the 2014 Autumn Statement to Parliament, the Chancellor announced a 0-2 year old early intervention pilot to prevent avoidable problems later in life. The Pilots will be run jointly by DfE and DH. They will complement the work of the Early Intervention Foundation, and link closely with other activity such as the Healthy Child Programme and the Troubled Families Programme. Details of how and where the pilots will operate will be made available shortly. Government will consider the emerging evidence in relation to prevention and intervening early with mental health problems."]
["Future"," 5. Supporting self-care by incentivising the development of new apps and digital tools; and consider whether there is a need for a kitemarking scheme in order to guide young people and their parents in respect of the quality of the different offers.","4.24 We propose that the Government asks the National Information Board to work in close partnership with the Government Digital Service and young people themselves to develop a single framework for harnessing the power of digital technology and protecting young people from mental harm (5). Within this framework, we propose that Government considers incentivising the development of new apps and digital tools; and also whether there is a need for some form of kite-marking scheme based on research evidence to guide young people and their parents on quality"]
["Current","Improving access to effective support – chapter 5 summary\nOur aim is to change how care is delivered and build it around the needs of children and young people and families. This means moving away from a system of care defined in terms of the services organisations provide to ensure that children and young people have easy access to the right support from the right service at the right time."]
{"$rows_left_out":49}
{"sheet":"Readiness_Sort","index":2,"n_rows":123,"n_cols":10,"rows_kept":123,"cut":false,"hidden":false,"merged":[]}
[null,null,"Northampton Self Assessment","Readiness Rating:","Complexity:","Size:",null,"C","S","Rat"]
[null,{"$f":"VLOOKUP(D2,Lookups!$B$9:$C$13,1,FALSE)","v":"4. Not Ready/ Anticipate Some Barriers to Change"},"2.3 DfE has invited schools, colleges and organisations to bid for a £3.5 million character education grant fund for local projects.","4. Not Ready/ Anticipate Some Barriers to Change","5. Very Complex","5. Very Large",null,{"$f":"IF(E2=\"\",0,VLOOKUP(E2,Lookups!$B$15:$C$20,2,FALSE))","v":5},{"$f":"IF(F2=\"\",0,VLOOKUP(F2,Lookups!$B$22:$C$27,2,FALSE))","v":5},{"$f":"SUM(H2*I2)","v":25}]
[null,{"$f":"VLOOKUP(D3,Lookups!$B$9:$C$13,1,FALSE)","v":"4. Not Ready/ Anticipate Some Barriers to Change"},"8.2 There should be a specific individual responsible for mental health in schools, to provide a link to expertise and support to discuss concerns about individual children and young people, identify issues and make effective referrals.","4. Not Ready/ Anticipate Some Barriers to Change","5. Very Complex","5. Very Large",null,{"$f":"IF(E3=\"\",0,VLOOKUP(E3,Lookups!$B$15:$C$20,2,FALSE))","v":5},{"$f":"IF(F3=\"\",0,VLOOKUP(F3,Lookups!$B$22:$C$27,2,FALSE))","v":5},25]
[null,{"$f":"VLOOKUP(D4,Lookups!$B$9:$C$13,1,FALSE)","v":"4. Not Ready/ Anticipate Some Barriers to Change"},"11.2 Further work should be done with relevant education and third sector partners to audit where peer support is currently available and evaluate it, building on existing work such as the Royal Society for Public Health Youth Health Champions. Local areas can then consider closing gaps in provision.","4. Not Ready/ Anticipate Some Barriers to Change","5. Very Complex","5. Very Large",null,{"$f":"IF(E4=\"\",0,VLOOKUP(E4,Lookups!$B$15:$C$20,2,FALSE))","v":5},{"$f":"IF(F4=\"\",0,VLOOKUP(F4,Lookups!$B$22:$C$27,2,FALSE))","v":5},25]
["Current",{"$f":"VLOOKUP(D5,Lookups!$B$9:$C$13,1,FALSE)","v":"4. Not Ready/ Anticipate Some Barriers to Change"},"15. Promoting implementation of best practice in transition, including ending arbitrary cut-off dates based on a particular age.","4. Not Ready/ Anticipate Some Barriers to Change","5. Very Complex","5. Very Large",{"$f":"VLOOKUP(D5,Lookups!$B$9:$C$13,2,FALSE)","v":4},{"$f":"IF(E5=\"\",0,VLOOKUP(E5,Lookups!$B$15:$C$20,2,FALSE))","v":5},{"$f":"IF(F5=\"\",0,VLOOKUP(F5,Lookups!$B$22:$C$27,2,FALSE))","v":5},25]
[null,{"$f":"VLOOKUP(D6,Lookups!$B$9:$C$13,1,FALSE)","v":"4. Not Ready/ Anticipate Some Barriers to Change"},"15.1 There is flexibility around age boundaries, in which transition is based on individual circumstances rather than absolute age, with joint working and shared practice between services to promote continuity of care.","4. Not Ready/ Anticipate Some Barriers to Change","5. Very Complex","5. Very Large",null,{"$f":"IF(E6=\"\",0,VLOOKUP(E6,Lookups!$B$15:$C$20,2,FALSE))","v":5},{"$f":"IF(F6=\"\",0,VLOOKUP(F6,Lookups!$B$22:$C$27,2,FALSE))","v":5},25]
["Current",{"$f":"VLOOKUP(D7,Lookups!$B$9:$C$13,1,FALSE)","v":"4. Not Ready/ Anticipate Some Barriers to Change"},"41. Implementing the recommendations of the Carter Review of Initial Teacher Training (ITT) to commission a sector body to produce a framework of core content for ITT which would include child and adolescent development. ","4. Not Ready/ Anticipate Some Barriers to Change","5. Very Complex","5. Very Large",{"$f":"VLOOKUP(D7,Lookups!$B$9:$C$13,2,FALSE)","v":4},{"$f":"IF(E7=\"\",0,VLOOKUP(E7,Lookups!$B$15:$C$20,2,FALSE))","v":5},{"$f":"IF(F7=\"\",0,VLOOKUP(F7,Lookups!$B$22:$C$27,2,FALSE))","v":5},25]
[null,{"$f":"VLOOKUP(D8,Lookups!$B$9:$C$13,1,FALSE)","v":"4. Not Ready/ Anticipate Some Barriers to Change"},"2.2 DfE is developing an evidence-based schools counselling strategy to encourage more and better use of counsellors in schools, with practical and evidence-based advice to ensure quality provision, that improves children’s outcomes and achieves value for money. This will be published in spring 2015. ","4. Not Ready/ Anticipate Some Barriers to Change","4. Complex","5. Very Large",null,{"$f":"IF(E8=\"\",0,VLOOKUP(E8,Lookups!$B$15:$C$20,2,FALSE))","v":4},{"$f":"IF(F8=\"\",0,VLOOKUP(F8,Lookups!$B$22:$C$27,2,FALSE))","v":5},20]
{"$rows_left_out":116}
{"sheet":"Self Assessment","index":3,"n_rows":146,"n_cols":10,"rows_kept":146,"cut":false,"hidden":false,"merged":[]}
[{"$f":"TODAY()","v":"2015-06-10"},null,{"$f":"Front_Sheet!C4","v":"Northampton Self Assessment"},"Readiness Rating:","Complexity:","Size:"]
[null,null,"Resilience, prevention and early intervention for the mental wellbeing of children and young people\nOur aim is to act early to prevent harm, by investing in the early years, supporting families and those who care for children and building resilience through to adulthood. Strategies should be developed in partnership with children and young people to support self-care. This will reduce the burden of mental and physical ill health over the whole life course.","Readiness Rating:","Complexity:","Size:",null,"C","S","Rat"]
["Current",{"$f":"VLOOKUP(D3,Lookups!$B$9:$C$13,1,FALSE)","v":"4. Not Ready/ Anticipate Some Barriers to Change"},"1. Promoting and driving established requirements and programmes of work on prevention and early intervention, including harnessing learning from the new 0-2 year old early intervention pilots.","4. Not Ready/ Anticipate Some Barriers to Change","3. Medium","3. Medium",{"$f":"VLOOKUP(D3,Lookups!$B$9:$C$13,2,FALSE)","v":4},{"$f":"IF(E3=\"\",0,VLOOKUP(E3,Lookups!$B$15:$C$20,2,FALSE))","v":3},{"$f":"IF(F3=\"\",0,VLOOKUP(F3,Lookups!$B$22:$C$27,2,FALSE))","v":3},{"$f":"SUM(H3*I3)","v":9}]
[null,{"$f":"VLOOKUP(D4,Lookups!$B$9:$C$13,1,FALSE)","v":"2. Partially Implemented"},"1.1 (Current Action) Reduce the incidence and impact of postnatal depression through earlier diagnosis, and better intervention and support.","2. Partially Implemented","3. Medium","3. Medium",null,{"$f":"IF(E4=\"\",0,VLOOKUP(E4,Lookups!$B$15:$C$20,2,FALSE))","v":3},{"$f":"IF(F4=\"\",0,VLOOKUP(F4,Lookups!$B$22:$C$27,2,FALSE))","v":3},{"$f":"SUM(H4*I4)","v":9}]
[null,{"$f":"VLOOKUP(D5,Lookups!$B$9:$C$13,1,FALSE)","v":"3. Changes Agreed but Not Started"},"1.2 (Current action) Every birthing unit should have access to a specialist perinatal mental health clinician by 2017.","3. Changes Agreed but Not Started","3. Medium","3. Medium",null,{"$f":"IF(E5=\"\",0,VLOOKUP(E5,Lookups!$B$15:$C$20,2,FALSE))","v":3},{"$f":"IF(F5=\"\",0,VLOOKUP(F5,Lookups!$B$22:$C$27,2,FALSE))","v":3},9]
[null,{"$f":"VLOOKUP(D6,Lookups!$B$9:$C$13,1,FALSE)","v":"1. Fully Implemented"},"1.3 (Current Action) The Institute for Health Visitors is updating training given to all health visitors around mental health and the Department of Health is working with HEE, the Royal College of Midwives and the Maternal Mental Health Alliance to design training programmes for midwives.","1. Fully Implemented","n/a","n/a",null,{"$f":"IF(E6=\"\",0,VLOOKUP(E6,Lookups!$B$15:$C$20,2,FALSE))","v":0},{"$f":"IF(F6=\"\",0,VLOOKUP(F6,Lookups!$B$22:$C$27,2,FALSE))","v":0},0]
[null,{"$f":"VLOOKUP(D7,Lookups!$B$9:$C$13,1,FALSE)","v":"3. Changes Agreed but Not Started"},"1.4(Current Action) Public Health England is publishing an update of the evidence base for the Healthy Child Programme (0-5 years) that will guide professionals including supporting early attachment between infant and parents","3. Changes Agreed but Not Started","3. Medium","4. Large",null,{"$f":"IF(E7=\"\",0,VLOOKUP(E7,Lookups!$B$15:$C$20,2,FALSE))","v":3},{"$f":"IF(F7=\"\",0,VLOOKUP(F7,Lookups!$B$22:$C$27,2,FALSE))","v":4},12]
["Current",{"$f":"VLOOKUP(D8,Lookups!$B$9:$C$13,1,FALSE)","v":"2. Partially Implemented"},"2. Continuing to develop whole school approaches to promoting mental health and wellbeing, including building on the Department for Education’s current work on character and resilience, PSHE and counselling services in schools.","2. Partially Implemented","3. Medium","5. Very Large",{"$f":"VLOOKUP(D8,Lookups!$B$9:$C$13,2,FALSE)","v":2},{"$f":"IF(E8=\"\",0,VLOOKUP(E8,Lookups!$B$15:$C$20,2,FALSE))","v":3},{"$f":"IF(F8=\"\",0,VLOOKUP(F8,Lookups!$B$22:$C$27,2,FALSE))","v":5},15]
{"$rows_left_out":139}
{"sheet":"Task Rating_Sort","index":4,"n_rows":123,"n_cols":10,"rows_kept":123,"cut":false,"hidden":false,"merged":[]}
[null,null,"Northampton Self Assessment","Readiness Rating:","Complexity:","Size:",null,"C","S","Rat"]
[null,{"$f":"VLOOKUP(D2,Lookups!$B$9:$C$13,1,FALSE)","v":"4. Not Ready/ Anticipate Some Barriers to Change"},"2.3 DfE has invited schools, colleges and organisations to bid for a £3.5 million character education grant fund for local projects.","4. Not Ready/ Anticipate Some Barriers to Change","5. Very Complex","5. Very Large",null,{"$f":"IF(E2=\"\",0,VLOOKUP(E2,Lookups!$B$15:$C$20,2,FALSE))","v":5},{"$f":"IF(F2=\"\",0,VLOOKUP(F2,Lookups!$B$22:$C$27,2,FALSE))","v":5},{"$f":"SUM(H2*I2)","v":25}]
[null,{"$f":"VLOOKUP(D3,Lookups!$B$9:$C$13,1,FALSE)","v":"4. Not Ready/ Anticipate Some Barriers to Change"},"8.2 There should be a specific individual responsible for mental health in schools, to provide a link to expertise and support to discuss concerns about individual children and young people, identify issues and make effective referrals.","4. Not Ready/ Anticipate Some Barriers to Change","5. Very Complex","5. Very Large",null,{"$f":"IF(E3=\"\",0,VLOOKUP(E3,Lookups!$B$15:$C$20,2,FALSE))","v":5},{"$f":"IF(F3=\"\",0,VLOOKUP(F3,Lookups!$B$22:$C$27,2,FALSE))","v":5},25]
[null,{"$f":"VLOOKUP(D4,Lookups!$B$9:$C$13,1,FALSE)","v":"4. Not Ready/ Anticipate Some Barriers to Change"},"11.2 Further work should be done with relevant education and third sector partners to audit where peer support is currently available and evaluate it, building on existing work such as the Royal Society for Public Health Youth Health Champions. Local areas can then consider closing gaps in provision.","4. Not Ready/ Anticipate Some Barriers to Change","5. Very Complex","5. Very Large",null,{"$f":"IF(E4=\"\",0,VLOOKUP(E4,Lookups!$B$15:$C$20,2,FALSE))","v":5},{"$f":"IF(F4=\"\",0,VLOOKUP(F4,Lookups!$B$22:$C$27,2,FALSE))","v":5},25]
["Current",{"$f":"VLOOKUP(D5,Lookups!$B$9:$C$13,1,FALSE)","v":"4. Not Ready/ Anticipate Some Barriers to Change"},"15. Promoting implementation of best practice in transition, including ending arbitrary cut-off dates based on a particular age.","4. Not Ready/ Anticipate Some Barriers to Change","5. Very Complex","5. Very Large",{"$f":"VLOOKUP(D5,Lookups!$B$9:$C$13,2,FALSE)","v":4},{"$f":"IF(E5=\"\",0,VLOOKUP(E5,Lookups!$B$15:$C$20,2,FALSE))","v":5},{"$f":"IF(F5=\"\",0,VLOOKUP(F5,Lookups!$B$22:$C$27,2,FALSE))","v":5},25]
[null,{"$f":"VLOOKUP(D6,Lookups!$B$9:$C$13,1,FALSE)","v":"4. Not Ready/ Anticipate Some Barriers to Change"},"15.1 There is flexibility around age boundaries, in which transition is based on individual circumstances rather than absolute age, with joint working and shared practice between services to promote continuity of care.","4. Not Ready/ Anticipate Some Barriers to Change","5. Very Complex","5. Very Large",null,{"$f":"IF(E6=\"\",0,VLOOKUP(E6,Lookups!$B$15:$C$20,2,FALSE))","v":5},{"$f":"IF(F6=\"\",0,VLOOKUP(F6,Lookups!$B$22:$C$27,2,FALSE))","v":5},25]
["Current",{"$f":"VLOOKUP(D7,Lookups!$B$9:$C$13,1,FALSE)","v":"4. Not Ready/ Anticipate Some Barriers to Change"},"41. Implementing the recommendations of the Carter Review of Initial Teacher Training (ITT) to commission a sector body to produce a framework of core content for ITT which would include child and adolescent development. ","4. Not Ready/ Anticipate Some Barriers to Change","5. Very Complex","5. Very Large",{"$f":"VLOOKUP(D7,Lookups!$B$9:$C$13,2,FALSE)","v":4},{"$f":"IF(E7=\"\",0,VLOOKUP(E7,Lookups!$B$15:$C$20,2,FALSE))","v":5},{"$f":"IF(F7=\"\",0,VLOOKUP(F7,Lookups!$B$22:$C$27,2,FALSE))","v":5},25]
["Future",{"$f":"VLOOKUP(D8,Lookups!$B$9:$C$13,1,FALSE)","v":"2. Partially Implemented"},"16. Improving communications, referrals and access to support through every area having named points of contact in specialist mental health services and schools, single points of access and one-stop-shop services, as a key part of any universal local offer.","2. Partially Implemented","5. Very Complex","5. Very Large",{"$f":"VLOOKUP(D8,Lookups!$B$9:$C$13,2,FALSE)","v":2},{"$f":"IF(E8=\"\",0,VLOOKUP(E8,Lookups!$B$15:$C$20,2,FALSE))","v":5},{"$f":"IF(F8=\"\",0,VLOOKUP(F8,Lookups!$B$22:$C$27,2,FALSE))","v":5},25]
{"$rows_left_out":116}
{"sheet":"Graphs","index":5,"n_rows":33,"n_cols":17,"rows_kept":33,"cut":false,"hidden":false,"merged":[[32,1,33,23],[0,16,0,22]]}
["Graphs:",{"$f":"Front_Sheet!C4","v":"Northampton Self Assessment"},null,null,null,null,null,null,null,null,null,null,null,null,null,null,{"$f":"TODAY()","v":"2015-06-10"}]
[]
["Promoting Resilience, Prevention and Early Intervention",{"$f":"'Self Assessment'!D20","v":2.6}]
["Improving Access to Effective Support - A System Without Tiers",{"$f":"'Self Assessment'!D63","v":2.2857142857142856}]
["Care for the Most Vulnerable",{"$f":"'Self Assessment'!D87","v":1.9}]
["Accountability and Transparency",{"$f":"'Self Assessment'!D114","v":1.6}]
["Developing the Workforce",{"$f":"'Self Assessment'!D137","v":2.8333333333333335}]
["Making Change Happen",{"$f":"'Self Assessment'!D146","v":2.5}]
{"$rows_left_out":26}
{"sheet":"Lookups","index":6,"n_rows":27,"n_cols":3,"rows_kept":27,"cut":false,"hidden":true,"merged":[]}
[]
[null,"People (e.g. communication, change management, skills, capacity etc.)"]
[null,"Machines (e.g. IT equipment, IT systems, telephones, transportation etc.)"]
[null,"Materials (e.g. leaflets, service user documentation etc.) "]
[null,"Methods (working practices, processes and procedures, management structures etc.)"]
[null,"Measurement (e.g. accurate tracking, correct measurements, lack of usable data etc.)"]
[null,"Environment (e.g. office locations, area covered by service, age appropriate settings etc.)"]
[]
{"$rows_left_out":19}